Useful or not, from you.
safety-db Getting error as FAILED. Kindly help for the solution

FAIL: test_using_valid_specifier_sets_0000__meta (main.TestData)

Traceback (most recent call last): File "C:\Users\COMP\AppData\Local\Programs\Python\Python37\lib\site-packages\parameterized\parameterized.py", line 530, in standalone_func return func(*(a + p.args), **p.kwargs) File "D:\safety-db-master\tests.py", line 28, in test_using_valid_specifier_sets self.failUnless(specifier_set, msg=message) AssertionError: None is not true : Bad specifier for $meta: 'advisory'

====================================================================== FAIL: test_using_valid_specifier_sets_0001__meta (main.TestData)

Traceback (most recent call last): File "C:\Users\COMP\AppData\Local\Programs\Python\Python37\lib\site-packages\parameterized\parameterized.py", line 530, in standalone_func return func(*(a + p.args), **p.kwargs) File "D:\safety-db-master\tests.py", line 28, in test_using_valid_specifier_sets self.failUnless(specifier_set, msg=message) AssertionError: None is not true : Bad specifier for $meta: 'timestamp'


Ran 1903 tests in 7.515s

FAILED (failures=2)

That's a useful answer
Without any help

@SofyaTavrovskaya thank you! your fix was merged, because of that I closed this issue.