Useful or not, from you.
+128
error Failed to build iOS project. We ran "xcodebuild" command but it exited with error code 65
Last update time in 2 months
+106
Error: Unable to resolve module `./debugger-ui/debuggerWorker.cff11639.js` from ``: - react-native
Last update time in 2 months
+96
Task :app:stripDebugDebugSymbols FAILED & Task :app:generateDebugBuildConfig FAILED - react-native
Last update time in 13 days
+95
React Native BUILD FAILED on run-ios
Last update time in 2 months
+92
xcode 11.4 build fatal error: module map file xxx/Build/Products/Debug-iphoneos/YogaKit/YogaKit.modulemap' not found
Last update time in 2 months
+86
Unknown failure cmd: Can't find service: package
Last update time in 2 months
+81
(react-native run-android) -> Error: Command failed: ./gradlew installDebug
Last update time in a month
+77
native_modules.gradle file is not downloading
Last update time in 3 days
+76
Invalid `Podfile` file: cannot load such file -- /Users/admin/Desktop/kandigram/node_modules/@react-native-community/cli-platform-ios/native_modules. # from /Users/admin/Desktop/kandigram/ios/Podfile:2 # ------------------------------------------- # platform :ios, '9.0' > require_relative '../node_modules/@react-native-community/cli-platform-ios/native_modules' # target 'Kandigram' do # -------------------------------------------
Last update time in 2 months
+74
yogakit/yogakit.modulemap' not found React Native
Last update time in 2 months
+74
No apps connected. Sending "reload" to all React Native apps failed. Make sure your app is running in the simulator or on a phone connected via USB. - react-native
Last update time in 2 months
+69
Error: Cannot find module 'warnOnce'
Last update time in 2 months
+69
React Native: java.lang.RuntimeException: Catalyst Instance has already disappeared: requested by WebSocketModule
Last update time in 2 months
+67
React Native: java.lang.RuntimeException: Catalyst Instance has already disappeared: requested by WebSocketModule - react-native
Last update time in 2 months
+65
Cant build react native from box in XCode: 'event2/event-config.h' file not found
Last update time in 2 months
+60
“However, this package itself specifies a `main` module field”, why?
Last update time in 2 months
+57
ERR_INVALID_ARG_TYPE(name, 'string', value); ^ TypeError [ERR_INVALID_ARG_TYPE]: The "path" argument must be of type string. Received type undefined at validateString (internal/validators.js:125:11) at Object.join (path.js:1147:7)
Last update time in 2 months
+57
Execution failed for task ':app:compileDebugJavaWithJavac'.
Last update time in 22 days
+55
Android bundle not loading from metro-bundler server
Last update time in 2 months
+53
NullPointerException:tempt to invoke virtual method 'android.graphics.drawable.Drawable android.graphics.drawable.Drawable$ConstantState.newDrawable(android.content.res.Resources)'
Last update time in 2 months
1 2 3 45 46 47